{"text_format":"1","workbook":"xlsx","n_sheets":3,"sheets":["Schedule","Picks","Standings"],"not_rendered":{"charts":0,"images":1,"macros":1,"external_links":0,"defined_names":7,"comments":0,"pivot_tables":0},"unopened":[],"bounds":{"document_bytes":16777216,"sheet_cells":100000,"rows_first":2000,"rows_last":500,"rows_between":2000,"halvings":0,"cell_chars":16384,"cell_head_chars":4096},"cells_cut":0,"cells_raw":0,"read":"whole","date_system":"1900"}

{"sheet":"Schedule","index":0,"n_rows":110,"n_cols":15,"rows_kept":110,"cut":false,"hidden":false,"merged":[]}
[null,null,null,{"$f":"+CONCATENATE(\"Date\",E1)","v":"DateAnaheim Ducks"},"Anaheim Ducks",{"$f":"+CONCATENATE(\"Date\",G1)","v":"DateSan Jose Sharks"},"San Jose Sharks",{"$f":"+CONCATENATE(\"Date\",I1)","v":"DateEdmonton Oilers"},"Edmonton Oilers",{"$f":"+CONCATENATE(\"Date\",K1)","v":"DateCalgary Flames"},"Calgary Flames",{"$f":"+CONCATENATE(\"Date\",M1)","v":"DateNashville Predators"},"Nashville Predators",{"$f":"+CONCATENATE(\"Date\",O1)","v":"DateSt. Louis Blues"},"St. Louis Blues"]
["2017-03-27","Arizona Coyotes","St. Louis Blues",{"$f":"+IF(E2=\"\",\"\",$A2)","v":""},{"$f":"+IF($B2=E$1,\"at \"&$C2,IF($C2=E$1,$B2,\"\"))","v":""},{"$f":"+IF(G2=\"\",\"\",$A2)","v":""},{"$f":"+IF($B2=G$1,\"at \"&$C2,IF($C2=G$1,$B2,\"\"))","v":""},{"$f":"+IF(I2=\"\",\"\",$A2)","v":""},{"$f":"+IF($B2=I$1,\"at \"&$C2,IF($C2=I$1,$B2,\"\"))","v":""},{"$f":"+IF(K2=\"\",\"\",$A2)","v":""},{"$f":"+IF($B2=K$1,\"at \"&$C2,IF($C2=K$1,$B2,\"\"))","v":""},{"$f":"+IF(M2=\"\",\"\",$A2)","v":""},{"$f":"+IF($B2=M$1,\"at \"&$C2,IF($C2=M$1,$B2,\"\"))","v":""},{"$f":"+IF(O2=\"\",\"\",$A2)","v":"2017-03-27"},{"$f":"+IF($B2=O$1,\"at \"&$C2,IF($C2=O$1,$B2,\"\"))","v":"Arizona Coyotes"}]
["2017-03-27","Florida Panthers","Buffalo Sabres",{"$f":"+IF(E3=\"\",\"\",$A3)","v":""},"","","","","","","","","","",""]
["2017-03-27","Colorado Avalanche","Calgary Flames","","","","","","","2017-03-27","Colorado Avalanche","","","",""]
["2017-03-27","Chicago Blackhawks","Tampa Bay Lightning","","","","","","","","","","","",""]
["2017-03-27","Nashville Predators","New York Islanders","","","","","","","","","2017-03-27","at New York Islanders","",""]
["2017-03-28","Anaheim Ducks","Vancouver Canucks","2017-03-28","at Vancouver Canucks","","","","","","","","","",""]
["2017-03-28","Nashville Predators","Boston Bruins","","","","","","","","","2017-03-28","at Boston Bruins","",""]
["2017-03-28","Buffalo Sabres","Columbus Blue Jackets","","","","","","","","","","","",""]
["2017-03-28","Detroit Red Wings","Carolina Hurricanes","","","","","","","","","","","",""]
["2017-03-28","Dallas Stars","Montreal Canadiens","","","","","","","","","","","",""]
["2017-03-28","Los Angeles Kings","Edmonton Oilers","","","","","2017-03-28","Los Angeles Kings","","","","","",""]
["2017-03-28","Florida Panthers","Toronto Maple Leafs","","","","","","","","","","","",""]
["2017-03-28","Washington Capitals","Minnesota Wild","","","","","","","","","","","",""]
["2017-03-28","New York Rangers","San Jose Sharks","","","2017-03-28","New York Rangers","","","","","","","",""]
["2017-03-28","Ottawa Senators","Philadelphia Flyers","","","","","","","","","","","",""]
["2017-03-29","St. Louis Blues","Arizona Coyotes","","","","","","","","","","","2017-03-29","at Arizona Coyotes"]
["2017-03-29","Los Angeles Kings","Calgary Flames","","","","","","","2017-03-29","Los Angeles Kings","","","",""]
["2017-03-29","Chicago Blackhawks","Pittsburgh Penguins","","","","","","","","","","","",""]
["2017-03-29","Washington Capitals","Colorado Avalanche","","","","","","","","","","","",""]
["2017-03-30","Anaheim Ducks","Winnipeg Jets","2017-03-30","at Winnipeg Jets","","","","","","","","","",""]
["2017-03-30","Dallas Stars","Boston Bruins","","","","","","","","","","","",""]
["2017-03-30","Columbus Blue Jackets","Carolina Hurricanes","","","","","","","","","","","",""]
["2017-03-30","Detroit Red Wings","Tampa Bay Lightning","","","","","","","","","","","",""]
["2017-03-30","San Jose Sharks","Edmonton Oilers","","","2017-03-30","at Edmonton Oilers","2017-03-30","San Jose Sharks","","","","","",""]
["2017-03-30","Florida Panthers","Montreal Canadiens","","","","","","","","","","","",""]
["2017-03-30","Ottawa Senators","Minnesota Wild","","","","","","","","","","","",""]
["2017-03-30","Toronto Maple Leafs","Nashville Predators","","","","","","","","","2017-03-30","Toronto Maple Leafs","",""]
["2017-03-30","New York Islanders","Philadelphia Flyers","","","","","","","","","","","",""]
["2017-03-31","Washington Capitals","Arizona Coyotes","","","","","","","","","","","",""]
["2017-03-31","Columbus Blue Jackets","Chicago Blackhawks","","","","","","","","","","","",""]
["2017-03-31","San Jose Sharks","Calgary Flames","","","2017-03-31","at Calgary Flames","","","2017-03-31","San Jose Sharks","","","",""]
["2017-03-31","St. Louis Blues","Colorado Avalanche","","","","","","","","","","","2017-03-31","at Colorado Avalanche"]
["2017-03-31","Los Angeles Kings","Vancouver Canucks","","","","","","","","","","","",""]
["2017-03-31","New Jersey Devils","New York Islanders","","","","","","","","","","","",""]
["2017-03-31","Pittsburgh Penguins","New York Rangers","","","","","","","","","","","",""]
["2017-04-01","Anaheim Ducks","Edmonton Oilers","2017-04-01","at Edmonton Oilers","","","2017-04-01","Anaheim Ducks","","","","","",""]
["2017-04-01","Florida Panthers","Boston Bruins","","","","","","","","","","","",""]
["2017-04-01","Dallas Stars","Carolina Hurricanes","","","","","","","","","","","",""]
["2017-04-01","Toronto Maple Leafs","Detroit Red Wings","","","","","","","","","","","",""]
["2017-04-01","Minnesota Wild","Nashville Predators","","","","","","","","","2017-04-01","Minnesota Wild","",""]
["2017-04-01","Montreal Canadiens","Tampa Bay Lightning","","","","","","","","","","","",""]
["2017-04-01","New Jersey Devils","Philadelphia Flyers","","","","","","","","","","","",""]
["2017-04-01","Ottawa Senators","Winnipeg Jets","","","","","","","","","","","",""]
["2017-04-02","Anaheim Ducks","Calgary Flames","2017-04-02","at Calgary Flames","","","","","2017-04-02","Anaheim Ducks","","","",""]
["2017-04-02","Arizona Coyotes","Los Angeles Kings","","","","","","","","","","","",""]
["2017-04-02","Boston Bruins","Chicago Blackhawks","","","","","","","","","","","",""]
["2017-04-02","New York Islanders","Buffalo Sabres","","","","","","","","","","","",""]
["2017-04-02","Carolina Hurricanes","Pittsburgh Penguins","","","","","","","","","","","",""]
["2017-04-02","Washington Capitals","Columbus Blue Jackets","","","","","","","","","","","",""]
["2017-04-02","Colorado Avalanche","Minnesota Wild","","","","","","","","","","","",""]
["2017-04-02","Dallas Stars","Tampa Bay Lightning","","","","","","","","","","","",""]
["2017-04-02","Nashville Predators","St. Louis Blues","","","","","","","","","2017-04-02","at St. Louis Blues","2017-04-02","Nashville Predators"]
["2017-04-02","Philadelphia Flyers","New York Rangers","","","","","","","","","","","",""]
["2017-04-02","San Jose Sharks","Vancouver Canucks","","","2017-04-02","at Vancouver Canucks","","","","","","","",""]
["2017-04-03","Toronto Maple Leafs","Buffalo Sabres","","","","","","","","","","","",""]
["2017-04-03","Ottawa Senators","Detroit Red Wings","","","","","","","","","","","",""]
["2017-04-03","Montreal Canadiens","Florida Panthers","","","","","","","","","","","",""]
["2017-04-04","Calgary Flames","Anaheim Ducks","2017-04-04","Calgary Flames","","","","","2017-04-04","at Anaheim Ducks","","","",""]
["2017-04-04","Arizona Coyotes","Dallas Stars","","","","","","","","","","","",""]
["2017-04-04","Tampa Bay Lightning","Boston Bruins","","","","","","","","","","","",""]
["2017-04-04","Carolina Hurricanes","Minnesota Wild","","","","","","","","","","","",""]
["2017-04-04","Columbus Blue Jackets","Pittsburgh Penguins","","","","","","","","","","","",""]
["2017-04-04","Chicago Blackhawks","Colorado Avalanche","","","","","","","","","","","",""]
["2017-04-04","Detroit Red Wings","Ottawa Senators","","","","","","","","","","","",""]
["2017-04-04","Edmonton Oilers","Los Angeles Kings","",{"$f":"+IF($B66=E$1,\"at \"&$C66,IF($C66=E$1,$B66,\"\"))","v":""},"",{"$f":"+IF($B66=G$1,\"at \"&$C66,IF($C66=G$1,$B66,\"\"))","v":""},{"$f":"+IF(I66=\"\",\"\",$A66)","v":"2017-04-04"},{"$f":"+IF($B66=I$1,\"at \"&$C66,IF($C66=I$1,$B66,\"\"))","v":"at Los Angeles Kings"},{"$f":"+IF(K66=\"\",\"\",$A66)","v":""},{"$f":"+IF($B66=K$1,\"at \"&$C66,IF($C66=K$1,$B66,\"\"))","v":""},{"$f":"+IF(M66=\"\",\"\",$A66)","v":""},{"$f":"+IF($B66=M$1,\"at \"&$C66,IF($C66=M$1,$B66,\"\"))","v":""},{"$f":"+IF(O66=\"\",\"\",$A66)","v":""},{"$f":"+IF($B66=O$1,\"at \"&$C66,IF($C66=O$1,$B66,\"\"))","v":""}]
["2017-04-04","Philadelphia Flyers","New Jersey Devils",{"$f":"+IF(E67=\"\",\"\",$A67)","v":""},"","","","","","","","","","",""]
["2017-04-04","New York Islanders","Nashville Predators","","","","","","","","","2017-04-04","New York Islanders","",""]
["2017-04-04","Vancouver Canucks","San Jose Sharks","","","2017-04-04","Vancouver Canucks","","","","","","","",""]
["2017-04-04","Winnipeg Jets","St. Louis Blues","","","","","","","","","","","2017-04-04","Winnipeg Jets"]
["2017-04-04","Washington Capitals","Toronto Maple Leafs","","","","","","","","","","","",""]
["2017-04-05","Montreal Canadiens","Buffalo Sabres","","","","","","","","","","","",""]
["2017-04-05","New York Rangers","Washington Capitals","","","","","","","","","","","",""]
["2017-04-06","Chicago Blackhawks","Anaheim Ducks","2017-04-06","Chicago Blackhawks","","","","","","","","","",""]
["2017-04-06","Vancouver Canucks","Arizona Coyotes","","","","","","","","","","","",""]
["2017-04-06","Ottawa Senators","Boston Bruins","","","","","","","","","","","",""]
["2017-04-06","New York Islanders","Carolina Hurricanes","","","","","","","","","","","",""]
["2017-04-06","Winnipeg Jets","Columbus Blue Jackets","","","","","","","","","","","",""]
["2017-04-06","Calgary Flames","Los Angeles Kings","","","","","","","2017-04-06","at Los Angeles Kings","","","",""]
["2017-04-06","Minnesota Wild","Colorado Avalanche","","","","","","","","","","","",""]
{"$rows_left_out":31}
{"sheet":"Picks","index":1,"n_rows":38,"n_cols":19,"rows_kept":38,"cut":false,"hidden":false,"merged":[[0,2,0,6],[0,14,0,17],[0,8,0,11],[10,2,10,18],[12,2,12,3],[12,5,12,6],[12,8,12,9],[12,11,12,12],[12,14,12,15],[12,17,12,18]]}
[null,null,"EXISTING",null,null,null,null,null,"PICKS",null,null,null,null,null,"RESULTING"]
[null,null,"Team","GP",null,"ROW","Pts",null,"GP","ROW",null,"Pts",null,null,"GP","ROW",null,"PTS"]
[3,null,"Anaheim",{"$f":"+INDEX(Standings!$A$14:$P$45,MATCH(\"Anaheim\",Standings!$A$14:$A$45,0),MATCH(Picks!D$2,Standings!$A$14:$P$14,0))","v":75},null,{"$f":"+INDEX(Standings!$A$14:$P$45,MATCH(\"Anaheim\",Standings!$A$14:$A$45,0),MATCH(Picks!F$2,Standings!$A$14:$P$14,0))","v":38},{"$f":"+INDEX(Standings!$A$14:$P$45,MATCH(\"Anaheim\",Standings!$A$14:$A$45,0),MATCH(Picks!G$2,Standings!$A$14:$P$14,0))","v":93},null,{"$f":"SUM($D$31:$D$36)","v":0},{"$f":"+$D$31+$D$32","v":0},null,{"$f":"+($D$31+$D$32+$D$33)*2+($D$35+$D$36)","v":0},null,null,{"$f":"+D3+I3","v":75},{"$f":"+F3+J3","v":38},null,{"$f":"+G3+L3","v":93}]
[4,null,"San Jose",{"$f":"+INDEX(Standings!$A$14:$P$45,MATCH(\"San Jose\",Standings!$A$14:$A$45,0),MATCH(Picks!D$2,Standings!$A$14:$P$14,0))","v":75},null,{"$f":"+INDEX(Standings!$A$14:$P$45,MATCH(\"San Jose\",Standings!$A$14:$A$45,0),MATCH(Picks!F$2,Standings!$A$14:$P$14,0))","v":40},{"$f":"+INDEX(Standings!$A$14:$P$45,MATCH(\"San Jose\",Standings!$A$14:$A$45,0),MATCH(Picks!G$2,Standings!$A$14:$P$14,0))","v":91},null,{"$f":"SUM($G$31:$G$36)","v":0},{"$f":"+$G$31+$G$32","v":0},null,{"$f":"+($G$31+$G$32+$G$33)*2+($G$35+$G$36)","v":0},null,null,{"$f":"+D4+I4","v":75},{"$f":"+F4+J4","v":40},null,{"$f":"+G4+L4","v":91}]
[5,null,"Edmonton",{"$f":"+INDEX(Standings!$A$14:$P$45,MATCH(\"Edmonton\",Standings!$A$14:$A$45,0),MATCH(Picks!D$2,Standings!$A$14:$P$14,0))","v":75},null,{"$f":"+INDEX(Standings!$A$14:$P$45,MATCH(\"Edmonton\",Standings!$A$14:$A$45,0),MATCH(Picks!F$2,Standings!$A$14:$P$14,0))","v":37},{"$f":"+INDEX(Standings!$A$14:$P$45,MATCH(\"Edmonton\",Standings!$A$14:$A$45,0),MATCH(Picks!G$2,Standings!$A$14:$P$14,0))","v":91},null,{"$f":"SUM($J$31:$J$36)","v":0},{"$f":"+$J$31+$J$32","v":0},null,{"$f":"+($J$31+$J$32+$J$33)*2+($J$35+$J$36)","v":0},null,null,{"$f":"+D5+I5","v":75},{"$f":"+F5+J5","v":37},null,{"$f":"+G5+L5","v":91}]
[6,null,"St. Louis",{"$f":"+INDEX(Standings!$A$14:$P$45,MATCH(\"St. Louis\",Standings!$A$14:$A$45,0),MATCH(Picks!D$2,Standings!$A$14:$P$14,0))","v":74},null,{"$f":"+INDEX(Standings!$A$14:$P$45,MATCH(\"St. Louis\",Standings!$A$14:$A$45,0),MATCH(Picks!F$2,Standings!$A$14:$P$14,0))","v":39},{"$f":"+INDEX(Standings!$A$14:$P$45,MATCH(\"St. Louis\",Standings!$A$14:$A$45,0),MATCH(Picks!G$2,Standings!$A$14:$P$14,0))","v":86},null,{"$f":"SUM($S$31:$S$36)","v":0},{"$f":"+$S$31+$S$32","v":0},null,{"$f":"+($S$31+$S$32+$S$33)*2+($S$35+$S$36)","v":0},null,null,{"$f":"+D6+I6","v":74},{"$f":"+F6+J6","v":39},null,{"$f":"+G6+L6","v":86}]
[7,null,"Calgary",{"$f":"+INDEX(Standings!$A$14:$P$45,MATCH(\"Calgary\",Standings!$A$14:$A$45,0),MATCH(Picks!D$2,Standings!$A$14:$P$14,0))","v":75},null,{"$f":"+INDEX(Standings!$A$14:$P$45,MATCH(\"Calgary\",Standings!$A$14:$A$45,0),MATCH(Picks!F$2,Standings!$A$14:$P$14,0))","v":38},{"$f":"+INDEX(Standings!$A$14:$P$45,MATCH(\"Calgary\",Standings!$A$14:$A$45,0),MATCH(Picks!G$2,Standings!$A$14:$P$14,0))","v":88},null,{"$f":"SUM($M$31:$M$36)","v":0},{"$f":"+$M$31+$M$32","v":0},null,{"$f":"+($M$31+$M$32+$M$33)*2+($M$35+$M$36)","v":0},null,null,{"$f":"+D7+I7","v":75},{"$f":"+F7+J7","v":38},null,{"$f":"+G7+L7","v":88}]
[8,null,"Nashville",{"$f":"+INDEX(Standings!$A$14:$P$45,MATCH(\"Nashville\",Standings!$A$14:$A$45,0),MATCH(Picks!D$2,Standings!$A$14:$P$14,0))","v":74},null,{"$f":"+INDEX(Standings!$A$14:$P$45,MATCH(\"Nashville\",Standings!$A$14:$A$45,0),MATCH(Picks!F$2,Standings!$A$14:$P$14,0))","v":36},{"$f":"+INDEX(Standings!$A$14:$P$45,MATCH(\"Nashville\",Standings!$A$14:$A$45,0),MATCH(Picks!G$2,Standings!$A$14:$P$14,0))","v":87},null,{"$f":"SUM($P$31:$P$36)","v":0},{"$f":"+$P$31+$P$32","v":0},null,{"$f":"+($P$31+$P$32+$P$33)*2+($P$35+$P$36)","v":0},null,null,{"$f":"+D8+I8","v":74},{"$f":"+F8+J8","v":36},null,{"$f":"+G8+L8","v":87}]
[null,null,null,null,null,null,null,null,null,null,null,null,"SORT"]
[]
[null,null,"Enter one of \"win\", \"loss\", \"otw\", \"sow\", \"otl\", or \"sol\" in the WHITE boxes below. Leave the shaded boxes alone"]
[]
["Date",null,"Anaheim Ducks",null,null,"San Jose Charks",null,null,"Edmonton Oilers",null,null,"Calgary Flames",null,null,"Nashville Predators",null,null,"St. Louis Blues"]
[]
["2017-03-27",null,{"$f":"IF(ISERROR(VLOOKUP($A15,Team1,2,FALSE)),\"\",VLOOKUP($A15,Team1,2,FALSE))","v":""},null,null,{"$f":"IF(ISERROR(VLOOKUP($A15,Team2,2,FALSE)),\"\",VLOOKUP($A15,Team2,2,FALSE))","v":""},null,null,{"$f":"IF(ISERROR(VLOOKUP($A15,Team3,2,FALSE)),\"\",VLOOKUP($A15,Team3,2,FALSE))","v":""},null,null,{"$f":"IF(ISERROR(VLOOKUP($A15,Team4,2,FALSE)),\"\",VLOOKUP($A15,Team4,2,FALSE))","v":"Colorado Avalanche"},null,null,{"$f":"IF(ISERROR(VLOOKUP($A15,Team5,2,FALSE)),\"\",VLOOKUP($A15,Team5,2,FALSE))","v":"at New York Islanders"},null,null,{"$f":"IF(ISERROR(VLOOKUP($A15,Team6,2,FALSE)),\"\",VLOOKUP($A15,Team6,2,FALSE))","v":"Arizona Coyotes"}]
[{"$f":"+A15+1","v":"2017-03-28"},null,"at Vancouver Canucks",null,null,"New York Rangers",null,null,"Los Angeles Kings",null,null,"",null,null,"at Boston Bruins",null,null,""]
["2017-03-29",null,"",null,null,"",null,null,"",null,null,"Los Angeles Kings",null,null,"",null,null,"at Arizona Coyotes"]
["2017-03-30",null,"at Winnipeg Jets",null,null,"at Edmonton Oilers",null,null,"San Jose Sharks",{"$f":"+IF(G18=\"win\",\"loss\",IF(G18=\"loss\",\"win\",IF(G18=\"otw\",\"otl\",IF(G18=\"otl\",\"otw\",IF(G18=\"sow\",\"sol\",IF(G18=\"sol\",\"sow\",\"\"))))))","v":""},null,"",null,null,"Toronto Maple Leafs",null,null,""]
["2017-03-31",null,"",null,null,"at Calgary Flames",null,null,"",null,null,"San Jose Sharks",{"$f":"+IF(G19=\"win\",\"loss\",IF(G19=\"loss\",\"win\",IF(G19=\"otw\",\"otl\",IF(G19=\"otl\",\"otw\",IF(G19=\"sow\",\"sol\",IF(G19=\"sol\",\"sow\",\"\"))))))","v":""},null,"",null,null,"at Colorado Avalanche"]
["2017-04-01",null,"at Edmonton Oilers",null,null,"",null,null,"Anaheim Ducks",{"$f":"+IF(D20=\"win\",\"loss\",IF(D20=\"loss\",\"win\",IF(D20=\"otw\",\"otl\",IF(D20=\"otl\",\"otw\",IF(D20=\"sow\",\"sol\",IF(D20=\"sol\",\"sow\",\"\"))))))","v":""},null,"",null,null,"Minnesota Wild",null,null,""]
["2017-04-02",null,"at Calgary Flames",null,null,"at Vancouver Canucks",null,null,"",null,null,"Anaheim Ducks",{"$f":"+IF(D21=\"win\",\"loss\",IF(D21=\"loss\",\"win\",IF(D21=\"otw\",\"otl\",IF(D21=\"otl\",\"otw\",IF(D21=\"sow\",\"sol\",IF(D21=\"sol\",\"sow\",\"\"))))))","v":""},null,"at St. Louis Blues",null,null,"Nashville Predators",{"$f":"+IF(P21=\"win\",\"loss\",IF(P21=\"loss\",\"win\",IF(P21=\"otw\",\"otl\",IF(P21=\"otl\",\"otw\",IF(P21=\"sow\",\"sol\",IF(P21=\"sol\",\"sow\",\"\"))))))","v":""}]
["2017-04-03",null,"",null,null,"",null,null,"",null,null,"",null,null,"",null,null,""]
["2017-04-04",null,"Calgary Flames",null,null,"Vancouver Canucks",null,null,"at Los Angeles Kings",null,null,"at Anaheim Ducks",{"$f":"+IF(D23=\"win\",\"loss\",IF(D23=\"loss\",\"win\",IF(D23=\"otw\",\"otl\",IF(D23=\"otl\",\"otw\",IF(D23=\"sow\",\"sol\",IF(D23=\"sol\",\"sow\",\"\"))))))","v":""},null,"New York Islanders",null,null,"Winnipeg Jets"]
["2017-04-05",null,"",null,null,"",null,null,"",null,null,"",null,null,"",null,null,""]
["2017-04-06",null,"Chicago Blackhawks",null,null,"Edmonton Oilers",null,null,"at San Jose Sharks",{"$f":"+IF(G25=\"win\",\"loss\",IF(G25=\"loss\",\"win\",IF(G25=\"otw\",\"otl\",IF(G25=\"otl\",\"otw\",IF(G25=\"sow\",\"sol\",IF(G25=\"sol\",\"sow\",\"\"))))))","v":""},null,"at Los Angeles Kings",null,null,"at Dallas Stars",null,null,"at Florida Panthers"]
["2017-04-07",null,"",null,null,"",null,null,"",null,null,"",null,null,"",null,null,""]
["2017-04-08",null,"",null,null,"Calgary Flames",null,null,"at Vancouver Canucks",null,null,"at San Jose Sharks",{"$f":"+IF(G27=\"win\",\"loss\",IF(G27=\"loss\",\"win\",IF(G27=\"otw\",\"otl\",IF(G27=\"otl\",\"otw\",IF(G27=\"sow\",\"sol\",IF(G27=\"sol\",\"sow\",\"\"))))))","v":""},null,"at Winnipeg Jets",null,null,"at Carolina Hurricanes"]
["2017-04-09",null,"Los Angeles Kings",null,null,"",null,null,"Vancouver Canucks",null,null,"",null,null,"",null,null,"Colorado Avalanche"]
[]
[]
["Win",null,null,{"$f":"+COUNTIF(D$15:D$29,$A31)","v":0},null,null,{"$f":"+COUNTIF(G$15:G$29,$A31)","v":0},null,null,{"$f":"+COUNTIF(J$15:J$29,$A31)","v":0},null,null,{"$f":"+COUNTIF(M$15:M$29,$A31)","v":0},null,null,{"$f":"+COUNTIF(P$15:P$29,$A31)","v":0},null,null,{"$f":"+COUNTIF(S$15:S$29,$A31)","v":0}]
["OTW",null,null,0,null,null,0,null,null,0,null,null,0,null,null,0,null,null,0]
["SOW",null,null,0,null,null,0,null,null,0,null,null,0,null,null,0,null,null,0]
["Loss",null,null,0,null,null,0,null,null,0,null,null,0,null,null,0,null,null,0]
["OTL",null,null,0,null,null,0,null,null,0,null,null,0,null,null,0,null,null,0]
["SOL",null,null,0,null,null,0,null,null,0,null,null,0,null,null,0,null,null,0]
[]
[null,null,null,{"$f":"+(D31+D32+D33)&\"-\"&(D34)&\"-\"&(D35+D36)","v":"0-0-0"},null,null,{"$f":"+(G31+G32+G33)&\"-\"&(G34)&\"-\"&(G35+G36)","v":"0-0-0"},null,null,{"$f":"+(J31+J32+J33)&\"-\"&(J34)&\"-\"&(J35+J36)","v":"0-0-0"},null,null,{"$f":"+(M31+M32+M33)&\"-\"&(M34)&\"-\"&(M35+M36)","v":"0-0-0"},null,null,{"$f":"+(P31+P32+P33)&\"-\"&(P34)&\"-\"&(P35+P36)","v":"0-0-0"},null,null,{"$f":"+(S31+S32+S33)&\"-\"&(S34)&\"-\"&(S35+S36)","v":"0-0-0"}]

{"sheet":"Standings","index":2,"n_rows":232,"n_cols":19,"rows_kept":232,"cut":false,"hidden":false,"merged":[]}
["NHL Standings - 2016-17"]
[]
["Group: League | Conference | Division"]
["Season:"]
[]
["Playoff Scenarios »"]
[]
["Standings"]
["Expanded Standings"]
["Vs. Division Standings"]
["Wild Card Standings"]
[]
["National Hockey League"]
["EASTERN","GP","W","L","OTL","PTS","ROW","SOW","SOL","HOME","ROAD","GF","GA","DIFF","L10","STRK"]
["x - Washington",74,49,17,8,106,47,2,5,"31-6-2","18-11-6",238,163,75,"2001-05-04","Won 4"]
["x - Columbus",74,48,19,7,103,46,2,2,"27-10-1","21-9-6",232,171,61,"2001-07-02","Won 1"]
["x - Pittsburgh",75,46,18,11,103,43,3,5,"29-5-4","17-13-7",258,211,47,"2003-05-02","Lost 3"]
["NY Rangers",76,46,26,4,96,43,3,3,"19-16-3","27-10-1",241,201,40,"2002-04-04","Lost 1"]
["Montreal",75,42,24,9,93,39,3,2,"22-11-5","20-13-4",204,187,17,"2001-06-03","Won 1"]
["Ottawa",74,41,25,8,90,36,5,2,"20-11-8","21-14-0",194,191,3,"2002-05-03","Lost 1"]
["Toronto",74,35,24,15,85,34,1,8,"19-10-7","16-14-8",227,219,8,"2001-07-02","Lost 1"]
["Boston",75,39,30,6,84,37,2,2,"19-16-0","20-14-6",214,202,12,"2000-05-05","Won 1"]
["NY Islanders",74,35,27,12,82,33,2,4,"20-11-7","15-16-5",218,225,-7,"2001-05-04","Lost 1"]
["Tampa Bay",74,36,29,9,81,32,4,3,"19-14-3","17-15-6",205,206,-1,"2001-06-03","Won 2"]
["Carolina",73,33,27,13,79,31,2,5,"21-10-4","2009-12-17",193,208,-15,"7-0-3","Won 3"]
["Philadelphia",75,35,32,8,78,29,6,4,"21-11-4","14-21-4",197,220,-23,"2000-04-06","Won 1"]
["Florida",74,33,30,11,77,28,5,6,"18-17-3","15-13-8",193,209,-16,"2000-04-06","Won 2"]
["Buffalo",75,31,32,12,74,29,2,6,"18-13-6","13-19-6",188,216,-28,"2000-04-06","Won 1"]
["Detroit",74,30,32,12,72,22,8,0,"15-16-6","15-16-6",184,217,-33,"2001-05-04","Won 1"]
["e - New Jersey",75,27,35,13,67,24,3,2,"15-15-7","2006-12-20",171,220,-49,"2001-02-07","Lost 3"]
["WESTERN","GP","W","L","OTL","PTS","ROW","SOW","SOL","HOME","ROAD","GF","GA","DIFF","L10","STRK"]
["x - Chicago",75,48,21,6,102,44,4,1,"25-9-5","23-12-1",225,192,33,"2001-06-03","Lost 1"]
["Minnesota",75,44,24,7,95,41,3,2,"24-12-1","20-12-6",240,190,50,"2001-02-07","Lost 3"]
["Anaheim",75,41,23,11,93,38,3,3,"26-8-4","15-15-7",199,185,14,"2001-08-01","Won 4"]
["San Jose",75,42,26,7,91,40,2,1,"23-10-4","19-16-3",201,182,19,"2000-03-07","Lost 6"]
["Edmonton",75,41,25,9,91,37,4,5,"21-12-4","20-13-5",223,195,28,"2001-06-03","Won 2"]
["Calgary",75,42,29,4,88,38,4,2,"22-15-0","20-14-4",207,202,5,"2000-07-03","Won 1"]
["Nashville",74,38,25,11,87,36,2,4,"23-8-7","15-17-4",222,205,17,"2002-06-02","Won 3"]
["St. Louis",74,40,28,6,86,39,1,1,"21-11-5","19-17-1",207,199,8,"2001-08-01","Lost 1"]
["Los Angeles",74,35,32,7,77,33,2,4,"21-14-2","14-18-5",180,186,-6,"2001-04-05","Lost 1"]
["Winnipeg",76,34,35,7,75,32,2,1,"19-18-1","15-17-6",225,241,-16,"2001-04-05","Won 1"]
["Dallas",75,31,33,11,73,31,0,2,"20-12-6","2005-11-21",206,238,-32,"2001-05-04","Won 2"]
["e - Vancouver",75,30,36,9,69,26,4,2,"18-13-6","2003-12-23",172,219,-47,"2002-02-06","Lost 1"]
["e - Arizona",75,27,39,9,63,21,6,2,"16-16-5","2004-11-23",180,240,-60,"2002-04-04","Lost 2"]
["e - Colorado",74,20,51,3,43,20,0,1,"2002-11-24","2001-09-27",145,249,-104,"2000-03-07","Lost 5"]
[]
["Glossary"]
[]
["GP: Games Played"]
["W: Wins"]
["L: Losses"]
["OTL: Overtime Losses"]
["PTS: Points"]
[]
["ROW: Regulation and Overtime Wins"]
["SOW: Shootout Wins",null,null,null,null,null,null,null,null,null,null,null,null,null,null,null,null,null,{"$f":"+D56-I56","v":0}]
["SOL: Shootout Losses",null,null,null,null,null,null,null,null,null,null,null,null,null,null,null,null,null,0]
["HOME: Home Record",null,null,null,null,null,null,null,null,null,null,null,null,null,null,null,null,null,0]
["ROAD: Road Record",null,null,null,null,null,null,null,null,null,null,null,null,null,null,null,null,null,0]
[null,null,null,null,null,null,null,null,null,null,null,null,null,null,null,null,null,null,0]
["GF: Goals For",null,null,null,null,null,null,null,null,null,null,null,null,null,null,null,null,null,0]
["GA: Goals Against",null,null,null,null,null,null,null,null,null,null,null,null,null,null,null,null,null,0]
["DIFF: Goal differential",null,null,null,null,null,null,null,null,null,null,null,null,null,null,null,null,null,0]
["L10: Record Last Ten"]
["STRK: Streak",null,null,null,null,null,null,null,null,null,null,null,null,null,null,null,null,null,{"$f":"+D65-I65","v":0}]
[null,null,null,null,null,null,null,null,null,null,null,null,null,null,null,null,null,null,{"$f":"+D66-I66","v":0}]
["Tiebreaking Procedures »",null,null,null,null,null,null,null,null,null,null,null,null,null,null,null,null,null,0]
[null,null,null,null,null,null,null,null,null,null,null,null,null,null,null,null,null,null,0]
["z - Clinched Best Record in Conference",null,null,null,null,null,null,null,null,null,null,null,null,null,null,null,null,null,0]
["y - Clinched Division Title",null,null,null,null,null,null,null,null,null,null,null,null,null,null,null,null,null,0]
["x - Clinched Playoff Berth",null,null,null,null,null,null,null,null,null,null,null,null,null,null,null,null,null,0]
["e - Eliminated from Playoff Contention"]
["* - Clinched Presidents' Trophy (Best Regular-Season Record)"]
[]
["Standings are updated with the completion of each game"]
[]
["SPONSORED HEADLINES"]
[]
["SPONSORED HEADLINES"]
[]
{"$rows_left_out":152}